Reaction Details
TargetStromelysin-1
LigandBDBM50288695
Substrate/Competitorn/a
Meas. Tech.ChEBML_102081
Ki 63±n/a nM
Citation Caldwell, CGSahoo, SPPolo, SAEversole, RRLanza, TJMills, SGNiedzwiecki, LMIzquierdo-Martin, MChang, BCHarrison, RKKuo, DWLin, TYStein, RLDurette, PLHagmann, WK Phosphinic acid inhibitors of matrix metalloproteinases Bioorg Med Chem Lett6:323-328 (1996)    Article
 
Stromelysin-1
Name:Stromelysin-1
Type:Enzyme
Mol. Mass.:53973.13
Organism:Homo sapiens (Human)
Description: P08254
Residue:477
BDBM50288695
NameBDBM50288695
Synonyms:(4-Benzyloxycarbonylamino-butyl)-[(S)-2-((S)-3-methyl-1-phenylcarbamoyl-butylcarbamoyl)-4-phenyl-butyl]-phosphinic acid | CHEMBL322540
TypeSmall organic molecule
Emp. Form.C35H46N3O6P
Mol. Mass.635.73
SMILESCC(C)C[C@H](NC(=O)[C@H](CCc1ccccc1)CP(O)(=O)CCCCNC(=O)OCc1ccccc1)C(=O)Nc1ccccc1