Reaction Details
TargetInterstitial collagenase
LigandBDBM50288710
Substrate/Competitorn/a
Meas. Tech.ChEBML_101755
Ki 2200±n/a nM
Citation Chapman, KTWales, JSahoo, SPNiedzwiecki, LMIzquierdo-Martin, MChang, BCHarrison, RKStein, RLHagmann, WK Inhibition of matrix metalloproteinases by P1 substituted N-carboxyalkyl dipeptides Bioorg Med Chem Lett6:329-332 (1996)    Article
 
Interstitial collagenase
Name:Interstitial collagenase
Type:Enzyme
Mol. Mass.:54010.26
Organism:Homo sapiens (Human)
Description: P03956
Residue:469
BDBM50288710
NameBDBM50288710
Synonyms:(R)-2-[(S)-1-((S)-3-Methyl-1-phenylcarbamoyl-butylcarbamoyl)-3-phenyl-propylamino]-5-(3-phenyl-propionylamino)-pentanoic acid | CHEMBL333831
TypeSmall organic molecule
Emp. Form.C36H46N4O5
Mol. Mass.614.7742
SMILESCC(C)C[C@H](NC(=O)[C@H](CCc1ccccc1)N[C@H](CCCNC(=O)CCc1ccccc1)C(O)=O)C(=O)Nc1ccccc1