Reaction Details
TargetStromelysin-1
LigandBDBM50288720
Substrate/Competitorn/a
Meas. Tech.ChEBML_102083
Ki 32±n/a nM
Citation Chapman, KTWales, JSahoo, SPNiedzwiecki, LMIzquierdo-Martin, MChang, BCHarrison, RKStein, RLHagmann, WK Inhibition of matrix metalloproteinases by P1 substituted N-carboxyalkyl dipeptides Bioorg Med Chem Lett6:329-332 (1996)    Article
 
Stromelysin-1
Name:Stromelysin-1
Type:Enzyme
Mol. Mass.:53973.13
Organism:Homo sapiens (Human)
Description: P08254
Residue:477
BDBM50288720
NameBDBM50288720
Synonyms:(R)-6-Benzoylamino-2-[(S)-1-((S)-3-methyl-1-phenylcarbamoyl-butylcarbamoyl)-3-phenyl-propylamino]-hexanoic acid | CHEMBL323917
TypeSmall organic molecule
Emp. Form.C35H44N4O5
Mol. Mass.600.7477
SMILESCC(C)C[C@H](NC(=O)[C@H](CCc1ccccc1)N[C@H](CCCCNC(=O)c1ccccc1)C(O)=O)C(=O)Nc1ccccc1