Reaction Details
TargetPeptidyl-prolyl cis-trans isomerase FKBP1A
LigandBDBM50288766
Substrate/Competitorn/a
Meas. Tech.ChEBML_195891
Ki>50000±n/a nM
Citation Babine, REBleckman, TMLittlefield, ESParge, HEPelletier, LALewis, CTFrench, JVImbacuan, MKatoh, STatlock, JHShowalter, REVillafranca, JE Design, synthesis and X-ray crystallographic studies of [7.3.1] and [8.3.1] macrocyclic FKBP-12 ligands Bioorg Med Chem Lett6:385-390 (1996)    Article
 
Peptidyl-prolyl cis-trans isomerase FKBP1A
Name:Peptidyl-prolyl cis-trans isomerase FKBP1A
Type:Isomerase
Mol. Mass.:11953.09
Organism:Homo sapiens (Human)
Description:P62942
Residue:108
BDBM50288766
NameBDBM50288766
Synonyms:(1S,9R)-13-{2-[(1S,2R,5R)-1-Hydroxy-5-(2-methoxy-1-methyl-ethyl)-2-methyl-cyclohexyl]-2-oxo-acetyl}-5-hydroxymethyl-3,7-dioxa-13-aza-bicyclo[7.3.1]tridecane-2,8-dione | CHEMBL337958
TypeSmall organic molecule
Emp. Form.C24H37NO9
Mol. Mass.483.5519
SMILESCOCC(C)[C@@H]1CC[C@@H](C)[C@@](O)(C1)C(=O)C(=O)N1[C@@H]2CCC[C@H]1C(=O)OCC(CO)COC2=O