Reaction Details
TargetPeptidyl-prolyl cis-trans isomerase FKBP1A
LigandBDBM50288767
Substrate/Competitorn/a
Meas. Tech.ChEBML_195891
Ki 10000±n/a nM
Citation Babine, REBleckman, TMLittlefield, ESParge, HEPelletier, LALewis, CTFrench, JVImbacuan, MKatoh, STatlock, JHShowalter, REVillafranca, JE Design, synthesis and X-ray crystallographic studies of [7.3.1] and [8.3.1] macrocyclic FKBP-12 ligands Bioorg Med Chem Lett6:385-390 (1996)    Article
 
Peptidyl-prolyl cis-trans isomerase FKBP1A
Name:Peptidyl-prolyl cis-trans isomerase FKBP1A
Type:Isomerase
Mol. Mass.:11953.09
Organism:Homo sapiens (Human)
Description:P62942
Residue:108
BDBM50288767
NameBDBM50288767
Synonyms:(1R,9S)-13-(3,3-Dimethyl-2-oxo-pentanoyl)-3,7-dioxa-13-aza-bicyclo[7.3.1]tridecane-2,8-dione | CHEMBL126512
TypeSmall organic molecule
Emp. Form.C17H25NO6
Mol. Mass.339.3835
SMILESCCC(C)(C)C(=O)C(=O)N1[C@@H]2CCC[C@H]1C(=O)OCCCOC2=O