Reaction Details
TargetPeptidyl-glycine alpha-amidating monooxygenase
LigandBDBM50288771
Substrate/Competitorn/a
Meas. Tech.ChEBML_152798
Ki 0.100000±n/a nM
Citation Casara, PGanzhorn, APhilippo, CChanal, MCDanzin, C Unsaturated thioacetic acids as novel mechanism-based inhibitors of peptidylglycine α-hydroxylating monooxygenase Bioorg Med Chem Lett6:393-396 (1996)    Article
 
Peptidyl-glycine alpha-amidating monooxygenase
Name:Peptidyl-glycine alpha-amidating monooxygenase
Type:PROTEIN
Mol. Mass.:108328.29
Organism:Homo sapiens (Human)
Description:ChEMBL_885021
Residue:973
BDBM50288771
NameBDBM50288771
Synonyms:((E)-Styrylsulfanyl)-acetic acid | CHEMBL127222
TypeSmall organic molecule
Emp. Form.C10H10O2S
Mol. Mass.194.25
SMILESOC(=O)CS\C=C\c1ccccc1