Reaction Details
TargetGag-Pol polyprotein [489-587]
LigandBDBM50288804
Substrate/Competitorn/a
Meas. Tech.ChEBML_159618
IC50 5±n/a nM
Citation Freskos, JNBertenshaw, DEGetman, DPHeintz, RMMischke, BVBlystone, LWBryant, MLFunckes-Shippy, CHouseman, KAKishore, NNKocan, GPMehta, PP (Hydroxyethyl) sulfonamide HIV-1 Protease inhibitors: Identification of the 2-methylbenzoyl moiety at P-2 Bioorg Med Chem Lett6:445-450 (1996)    Article
 
Gag-Pol polyprotein [489-587]
Name:Gag-Pol polyprotein [489-587]
Type:Enzyme Subunit
Mol. Mass.:10781.16
Organism:Human immunodeficiency virus type 1
Description:P04585[489-587]
Residue:99
BDBM50288804
NameBDBM50288804
Synonyms:CHEMBL139538 | N-{(1S,2R)-1-Benzyl-2-hydroxy-3-[isobutyl-(4-methoxy-benzenesulfonyl)-amino]-propyl}-2-methyl-benzamide
TypeSmall organic molecule
Emp. Form.C29H36N2O5S
Mol. Mass.524.672
SMILESCOc1ccc(cc1)S(=O)(=O)N(CC(C)C)C[C@@H](O)[C@H](Cc1ccccc1)NC(=O)c1ccccc1C