Reaction Details
Target3-oxo-5-alpha-steroid 4-dehydrogenase 2
LigandBDBM50403605
Substrate/Competitorn/a
Meas. Tech.ChEBML_202913
Ki 10000±n/a nM
Citation Abell, ADBrandt, MLevy, MAHolt, DA A comparison of steroidal and non-steroidal inhibitors of human steroid 5α-reductase: New tricyclic aryl acid inhibitors of the type-1 isozyme Bioorg Med Chem Lett6:481-484 (1996)    Article
 
3-oxo-5-alpha-steroid 4-dehydrogenase 2
Name:3-oxo-5-alpha-steroid 4-dehydrogenase 2
Type:Enzyme
Mol. Mass.:28406.59
Organism:Homo sapiens (Human)
Description:P31213
Residue:254
BDBM50403605
NameBDBM50403605
Synonyms:CHEMBL144346
TypeSmall organic molecule
Emp. Form.C14H10O2
Mol. Mass.210.228
SMILESOC(=O)c1ccc-2c(Cc3ccccc-23)c1