Reaction Details
Target3-oxo-5-alpha-steroid 4-dehydrogenase 1
LigandBDBM50403610
Substrate/Competitorn/a
Meas. Tech.ChEBML_202904
Ki 3200±n/a nM
Citation Abell, ADBrandt, MLevy, MAHolt, DA A comparison of steroidal and non-steroidal inhibitors of human steroid 5α-reductase: New tricyclic aryl acid inhibitors of the type-1 isozyme Bioorg Med Chem Lett6:481-484 (1996)    Article
 
3-oxo-5-alpha-steroid 4-dehydrogenase 1
Name:3-oxo-5-alpha-steroid 4-dehydrogenase 1
Type:Enzyme
Mol. Mass.:29472.80
Organism:Homo sapiens (Human)
Description:P18405
Residue:259
BDBM50403610
NameBDBM50403610
Synonyms:CHEMBL143220
TypeSmall organic molecule
Emp. Form.C24H38NO3P
Mol. Mass.419.5372
SMILESCC(C)(C)NC(=O)[C@H]1CCC2C3CCC4C=C(CC[C@]4(C)C3CC[C@]12C)P(=O)=O