Reaction Details
Target3-oxo-5-alpha-steroid 4-dehydrogenase 2
LigandBDBM50403608
Substrate/Competitorn/a
Meas. Tech.ChEBML_202913
Ki 1600±n/a nM
Citation Abell, ADBrandt, MLevy, MAHolt, DA A comparison of steroidal and non-steroidal inhibitors of human steroid 5α-reductase: New tricyclic aryl acid inhibitors of the type-1 isozyme Bioorg Med Chem Lett6:481-484 (1996)    Article
 
3-oxo-5-alpha-steroid 4-dehydrogenase 2
Name:3-oxo-5-alpha-steroid 4-dehydrogenase 2
Type:Enzyme
Mol. Mass.:28406.59
Organism:Homo sapiens (Human)
Description:P31213
Residue:254
BDBM50403608
NameBDBM50403608
Synonyms:CHEMBL439804
TypeSmall organic molecule
Emp. Form.C15H16ClO2P
Mol. Mass.294.713
SMILESC[C@]12CCC(CC1=CCc1cc(Cl)ccc21)P(=O)=O