Reaction Details
TargetAlpha-galactosidase A
LigandBDBM50182798
Substrate/Competitorn/a
Meas. Tech.ChEBML_216815
IC50 40000±n/a nM
Citation Igarashi, YIchikawa, MIchikawa, Y Synthesis of a new inhibitor of α-fucosidase Bioorg Med Chem Lett6:553-558 (1996)    Article
 
Alpha-galactosidase A
Name:Alpha-galactosidase A
Type:Protein
Mol. Mass.:48760.21
Organism:Homo sapiens (Human)
Description:n/a
Residue:429
BDBM50182798
NameBDBM50182798
Synonyms:(3R,4r,5S)-piperidine-3,4,5-triol CHEMBL110830 | PIPERIDINE-3,4,5-TRIOL
TypeSmall organic molecule
Emp. Form.C5H11NO3
Mol. Mass.133.1457
SMILESO[C@H]1CNC[C@@H](O)[C@@H]1O