Reaction Details
TargetCarbonic anhydrase 2
LigandBDBM50288860
Substrate/Competitorn/a
Meas. Tech.ChEBML_45054
Kd 270±n/a nM
Citation Sigal, GBWhitesides, GM Benzenesulfonamide-peptide conjugates as probes for secondary binding sites near the active site of carbonic anhydrase Bioorg Med Chem Lett6:559-564 (1996)    Article
 
Carbonic anhydrase 2
Name:Carbonic anhydrase 2
Type:Enzyme
Mol. Mass.:29250.71
Organism:Homo sapiens (Human)
Description:P00918
Residue:260
BDBM50288860
NameBDBM50288860
Synonyms:4-Carbamoyl-2-{2-[2-(4-sulfamoyl-benzoylamino)-acetylamino]-acetylamino}-butyric acid | CHEMBL2371114
TypeSmall organic molecule
Emp. Form.C16H21N5O8S
Mol. Mass.443.432
SMILESNC(=O)CC[C@H](NC(=O)CNC(=O)CNC(=O)c1ccc(cc1)S(N)(=O)=O)C(O)=O