Reaction Details
TargetCarbonic anhydrase 2
LigandBDBM50288867
Substrate/Competitorn/a
Meas. Tech.ChEBML_45054
Kd 420±n/a nM
Citation Sigal, GBWhitesides, GM Benzenesulfonamide-peptide conjugates as probes for secondary binding sites near the active site of carbonic anhydrase Bioorg Med Chem Lett6:559-564 (1996)    Article
 
Carbonic anhydrase 2
Name:Carbonic anhydrase 2
Type:Enzyme
Mol. Mass.:29250.71
Organism:Homo sapiens (Human)
Description:P00918
Residue:260
BDBM50288867
NameBDBM50288867
Synonyms:2-[2-(4-Sulfamoyl-benzoylamino)-acetylamino]-succinic acid | CHEMBL154174
TypeSmall organic molecule
Emp. Form.C13H15N3O8S
Mol. Mass.373.339
SMILESNS(=O)(=O)c1ccc(cc1)C(=O)NCC(=O)NC(CC(O)=O)C(O)=O