Reaction Details
TargetCarbonic anhydrase 2
LigandBDBM50288885
Substrate/Competitorn/a
Meas. Tech.ChEBML_45054
Kd 300±n/a nM
Citation Sigal, GBWhitesides, GM Benzenesulfonamide-peptide conjugates as probes for secondary binding sites near the active site of carbonic anhydrase Bioorg Med Chem Lett6:559-564 (1996)    Article
 
Carbonic anhydrase 2
Name:Carbonic anhydrase 2
Type:Enzyme
Mol. Mass.:29250.71
Organism:Homo sapiens (Human)
Description:P00918
Residue:260
BDBM50288885
NameBDBM50288885
Synonyms:2-{2-[2-(4-Sulfamoyl-benzoylamino)-acetylamino]-acetylamino}-propionic acid | CHEMBL2371105
TypeSmall organic molecule
Emp. Form.C16H21N5O8S
Mol. Mass.443.432
SMILESC[C@H](NC(=O)CNC(=O)CNC(=O)CNC(=O)c1ccc(cc1)S(N)(=O)=O)C(O)=O