Reaction Details
TargetCarbonic anhydrase 2
LigandBDBM50288894
Substrate/Competitorn/a
Meas. Tech.ChEBML_45054
Kd 330±n/a nM
Citation Sigal, GBWhitesides, GM Benzenesulfonamide-peptide conjugates as probes for secondary binding sites near the active site of carbonic anhydrase Bioorg Med Chem Lett6:559-564 (1996)    Article
 
Carbonic anhydrase 2
Name:Carbonic anhydrase 2
Type:Enzyme
Mol. Mass.:29250.71
Organism:Homo sapiens (Human)
Description:P00918
Residue:260
BDBM50288894
NameBDBM50288894
Synonyms:1-{2-[2-(4-Sulfamoyl-benzoylamino)-acetylamino]-acetyl}-pyrrolidine-2-carboxylic acid | CHEMBL2371075
TypeSmall organic molecule
Emp. Form.C18H23N5O8S
Mol. Mass.469.469
SMILESNS(=O)(=O)c1ccc(cc1)C(=O)NCC(=O)NCC(=O)NCC(=O)N1CCC[C@H]1C(O)=O