Reaction Details
TargetGag-Pol polyprotein [489-587]
LigandBDBM50288942
Substrate/Competitorn/a
Meas. Tech.ChEBML_160741
Ki 0.162000±n/a nM
Citation Park, CChoi, HSon, YCLee, CSChoy, NKoh, JSLee, TGKwon, YDKim, SCYoon, H β-Methanesulfonyl-L-valine as a novel, unnatural amino acid surrogate for P2 in the design of HIV protease inhibitors. Bioorg Med Chem Lett6:585-588 (1996)    Article
 
Gag-Pol polyprotein [489-587]
Name:Gag-Pol polyprotein [489-587]
Type:Enzyme Subunit
Mol. Mass.:10781.16
Organism:Human immunodeficiency virus type 1
Description:P04585[489-587]
Residue:99
BDBM50288942
NameBDBM50288942
Synonyms:CHEMBL154692 | {(R)-1-[(1S,2R)-1-Benzyl-3-((3S,4aS,8aS)-3-tert-butylcarbamoyl-octahydro-isoquinolin-2-yl)-2-hydroxy-propylcarbamoyl]-2-methanesulfonyl-2-methyl-propyl}-carbamic acid benzyl ester
TypeSmall organic molecule
Emp. Form.C38H56N4O7S
Mol. Mass.712.939
SMILESCC(C)(C)NC(=O)[C@@H]1C[C@@H]2CCCC[C@@H]2CN1C[C@@H](O)[C@H](Cc1ccccc1)NC(=O)[C@@H](NC(=O)OCc1ccccc1)C(C)(C)S(C)(=O)=O