Reaction Details
TargetGag-Pol polyprotein [489-587]
LigandBDBM50288946
Substrate/Competitorn/a
Meas. Tech.ChEBML_157722
Ki 18±n/a nM
Citation Lee, CSChoy, NPark, CChoi, HSon, YCKim, SOk, JHYoon, HKim, SC Design, synthesis, and characterization of dipeptide isostere containing cis-epoxide for the irreversible inactivation of HIV protease Bioorg Med Chem Lett6:589-594 (1996)    Article
 
Gag-Pol polyprotein [489-587]
Name:Gag-Pol polyprotein [489-587]
Type:Enzyme Subunit
Mol. Mass.:10781.16
Organism:Human immunodeficiency virus type 1
Description:P04585[489-587]
Residue:99
BDBM50288946
NameBDBM50288946
Synonyms:2-{2-[(2R,3S)-3-((S)-1-{3-Carbamoyl-2-[(quinoline-2-carbonyl)-amino]-propionylamino}-2-phenyl-ethyl)-oxiranyl]-acetylamino}-3-methyl-pentanoic acid | CHEMBL157945
TypeSmall organic molecule
Emp. Form.C32H37N5O7
Mol. Mass.603.6655
SMILESCCC(C)C(NC(=O)C[C@H]1O[C@H]1[C@H](Cc1ccccc1)NC(=O)C(CC(N)=O)NC(=O)c1ccc2ccccc2n1)C(O)=O