Reaction Details
TargetGag-Pol polyprotein [489-587]
LigandBDBM50288948
Substrate/Competitorn/a
Meas. Tech.ChEBML_157722
Ki 200000±n/a nM
Citation Lee, CSChoy, NPark, CChoi, HSon, YCKim, SOk, JHYoon, HKim, SC Design, synthesis, and characterization of dipeptide isostere containing cis-epoxide for the irreversible inactivation of HIV protease Bioorg Med Chem Lett6:589-594 (1996)    Article
 
Gag-Pol polyprotein [489-587]
Name:Gag-Pol polyprotein [489-587]
Type:Enzyme Subunit
Mol. Mass.:10781.16
Organism:Human immunodeficiency virus type 1
Description:P04585[489-587]
Residue:99
BDBM50288948
NameBDBM50288948
Synonyms:2-{2-[(2R,3R)-3-((S)-1-Benzyloxycarbonylamino-2-phenyl-ethyl)-oxiranyl]-acetylamino}-3-methyl-butyric acid | CHEMBL155895
TypeSmall organic molecule
Emp. Form.C25H30N2O6
Mol. Mass.454.5155
SMILESCC(C)C(NC(=O)C[C@H]1O[C@@H]1[C@H](Cc1ccccc1)NC(=O)OCc1ccccc1)C(O)=O