Reaction Details
TargetSubstance-K receptor
LigandBDBM50071484
Substrate/Competitorn/a
Meas. Tech.ChEBML_142875
IC50 0.800000±n/a nM
Citation Kersey, IDBhogal, NDonnelly, DFishwick, CWFindlay, JBWard, P A Non-peptidic photoactivatable antagonist for mapping the antagonist binding site of the tachykinin NK2 receptor Bioorg Med Chem Lett6:605-608 (1996)    Article
 
Substance-K receptor
Name:Substance-K receptor
Type:Protein
Mol. Mass.:44455.78
Organism:Homo sapiens (Human)
Description:P21452
Residue:398
BDBM50071484
NameBDBM50071484
Synonyms:CHEMBL308148 N-[(S)-4-(4-Acetylamino-4-phenyl-piperidin-1-yl)-2-(3,4-dichloro-phenyl)-butyl]-N-methyl-benzamide | Saredutant
TypeSmall organic molecule
Emp. Form.C31H35Cl2N3O2
Mol. Mass.552.535
SMILESCN(C[C@@H](CCN1CCC(CC1)(NC(C)=O)c1ccccc1)c1ccc(Cl)c(Cl)c1)C(=O)c1ccccc1