Reaction Details
TargetEndothelin-converting enzyme 1
LigandBDBM50288962
Substrate/Competitorn/a
Meas. Tech.ChEBML_64369
IC50 7700±n/a nM
Citation Kukkola, PJBilci, NAKozak, WXSavage, PJeng, AY Optimization of retro-thiorphan for inhibition of endothelin converting enzyme Bioorg Med Chem Lett6:619-624 (1996)    Article
 
Endothelin-converting enzyme 1
Name:Endothelin-converting enzyme 1
Type:Enzyme
Mol. Mass.:87155.11
Organism:Homo sapiens (Human)
Description:P42892
Residue:770
BDBM50288962
NameBDBM50288962
Synonyms:CHEMBL156964 | N-[(R)-2-(1H-Indol-3-yl)-1-mercaptomethyl-ethyl]-2-[4-(pyridin-3-ylmethoxy)-phenyl]-acetamide
TypeSmall organic molecule
Emp. Form.C25H25N3O2S
Mol. Mass.431.55
SMILESSC[C@@H](Cc1c[nH]c2ccccc12)NC(=O)Cc1ccc(OCc2cccnc2)cc1