Reaction Details
TargetComplement C1r subcomponent
LigandBDBM33703
Substrate/Competitorn/a
Meas. Tech.ChEMBL_40171 (CHEMBL655966)
IC50 15000±n/a nM
Citation Gilmore, JLHays, SJCaprathe, BWLee, CEmmerling, MRMichael, WJaen, JC Synthesis and evaluation of 2-aryl-4H-3,1-benzoxazin-4-ones as C1r serine protease inhibitors Bioorg Med Chem Lett6:679-682 (1996)    Article
 
Complement C1r subcomponent
Name:Complement C1r subcomponent
Type:Enzyme
Mol. Mass.:80113.65
Organism:Homo sapiens (Human)
Description:P00736
Residue:705
BDBM33703
NameBDBM33703
Synonyms:2-(2-Nitro-phenyl)-benzo[d][1,3]oxazin-4-one 2-(2-nitrophenyl)-3,1-benzoxazin-4-one SMR000174492 cid_347675
TypeSmall organic molecule
Emp. Form.C14H8N2O4
Mol. Mass.268.2243
SMILES[O-][N+](=O)c1ccccc1-c1nc2ccccc2c(=O)o1