Reaction Details
TargetComplement C1r subcomponent
LigandBDBM50288996
Substrate/Competitorn/a
Meas. Tech.ChEMBL_40172 (CHEMBL655967)
IC50>62500±n/a nM
Citation Gilmore, JLHays, SJCaprathe, BWLee, CEmmerling, MRMichael, WJaen, JC Synthesis and evaluation of 2-aryl-4H-3,1-benzoxazin-4-ones as C1r serine protease inhibitors Bioorg Med Chem Lett6:679-682 (1996)    Article
 
Complement C1r subcomponent
Name:Complement C1r subcomponent
Type:Enzyme
Mol. Mass.:80113.65
Organism:Homo sapiens (Human)
Description:P00736
Residue:705
BDBM50288996
NameBDBM50288996
Synonyms:2-(2-Trifluoromethyl-phenyl)-benzo[d][1,3]oxazin-4-one | CHEMBL352443
TypeSmall organic molecule
Emp. Form.C15H8F3NO2
Mol. Mass.291.2247
SMILESFC(F)(F)c1ccccc1-c1nc2ccccc2c(=O)o1