Reaction Details
TargetComplement C1r subcomponent
LigandBDBM50289012
Substrate/Competitorn/a
Meas. Tech.ChEMBL_40172 (CHEMBL655967)
IC50>62500±n/a nM
Citation Gilmore, JLHays, SJCaprathe, BWLee, CEmmerling, MRMichael, WJaen, JC Synthesis and evaluation of 2-aryl-4H-3,1-benzoxazin-4-ones as C1r serine protease inhibitors Bioorg Med Chem Lett6:679-682 (1996)    Article
 
Complement C1r subcomponent
Name:Complement C1r subcomponent
Type:Enzyme
Mol. Mass.:80113.65
Organism:Homo sapiens (Human)
Description:P00736
Residue:705
BDBM50289012
NameBDBM50289012
Synonyms:2-(2-Fluoro-phenyl)-benzo[d][1,3]oxazin-4-one CHEMBL161656
TypeSmall organic molecule
Emp. Form.C14H8FNO2
Mol. Mass.241.2172
SMILESFc1ccccc1-c1nc2ccccc2c(=O)o1