Reaction Details
TargetSerine protease 1
LigandBDBM50063703
Substrate/Competitorn/a
Meas. Tech.ChEBML_212693
IC50 15300±n/a nM
Citation Gilmore, JLHays, SJCaprathe, BWLee, CEmmerling, MRMichael, WJaen, JC Synthesis and evaluation of 2-aryl-4H-3,1-benzoxazin-4-ones as C1r serine protease inhibitors Bioorg Med Chem Lett6:679-682 (1996)    Article
 
Serine protease 1
Name:Serine protease 1
Type:Enzyme
Mol. Mass.:26557.80
Organism:Homo sapiens (Human)
Description:P07477
Residue:247
BDBM50063703
NameBDBM50063703
Synonyms:2-(2-Iodo-phenyl)-benzo[d][1,3]oxazin-4-one | CHEMBL10378
TypeSmall organic molecule
Emp. Form.C14H8INO2
Mol. Mass.349.1233
SMILESIc1ccccc1-c1nc2ccccc2c(=O)o1