Reaction Details
TargetComplement C1r subcomponent
LigandBDBM50063703
Substrate/Competitorn/a
Meas. Tech.ChEMBL_40168 (CHEMBL655963)
IC50 1370±n/a nM
Citation Gilmore, JLHays, SJCaprathe, BWLee, CEmmerling, MRMichael, WJaen, JC Synthesis and evaluation of 2-aryl-4H-3,1-benzoxazin-4-ones as C1r serine protease inhibitors Bioorg Med Chem Lett6:679-682 (1996)    Article
 
Complement C1r subcomponent
Name:Complement C1r subcomponent
Type:Enzyme
Mol. Mass.:80113.65
Organism:Homo sapiens (Human)
Description:P00736
Residue:705
BDBM50063703
NameBDBM50063703
Synonyms:2-(2-Iodo-phenyl)-benzo[d][1,3]oxazin-4-one | CHEMBL10378
TypeSmall organic molecule
Emp. Form.C14H8INO2
Mol. Mass.349.1233
SMILESIc1ccccc1-c1nc2ccccc2c(=O)o1