Reaction Details
Target5-hydroxytryptamine receptor 1A
LigandBDBM82517
Substrate/Competitorn/a
Meas. Tech.ChEMBL_1157 (CHEMBL616102)
Ki 0.600000±n/a nM
Citation López-Rodríguez, MLMorcillo, MRosado, MBenhamu, BSanz, AM 2-[4-(o-methoxyphenyl)piperazin-1-ylmethyl]-1,3-dioxoperhydroimidazo[1,5-a]pyridine as a new selective 5-HT1A receptor ligand Bioorg Med Chem Lett6:689-694 (1996)    Article
 
5-hydroxytryptamine receptor 1A
Name:5-hydroxytryptamine receptor 1A
Type:G Protein-Coupled Receptor (GPCR)
Mol. Mass.:46445.29
Organism:Rattus norvegicus (rat)
Description:Binding assays were performed using rat hippocampal membranes.
Residue:422
BDBM82517
NameBDBM82517
Synonyms:2-{4-[4-(2-Methoxy-phenyl)-piperazin-1-yl]-butyl}-isoindole-1,3-dione CHEMBL126632 NAN-190 | NSC_107966
TypeSmall organic molecule
Emp. Form.C23H27N3O3
Mol. Mass.393.4788
SMILESCOc1ccccc1N1CCN(CCCCN2C(=O)c3ccccc3C2=O)CC1