Reaction Details
TargetMetabotropic glutamate receptor 1
LigandBDBM50030627
Substrate/Competitorn/a
Meas. Tech.ChEBML_218869
IC50 700000±n/a nM
Citation Annoura, HFukunaga, AUesugi, MTatsuoka, THorikawa, Y A novel class of antagonists for metabotropic glutamate receptors, 7-(Hydroxyimino)cyclopropa[b]chromen-1a-carboxylates Bioorg Med Chem Lett6:763-766 (1996)    Article
 
Metabotropic glutamate receptor 1
Name:Metabotropic glutamate receptor 1
Type:Enzyme
Mol. Mass.:132358.19
Organism:Homo sapiens (Human)
Description:Q13255
Residue:1194
BDBM50030627
NameBDBM50030627
Synonyms:(+-)-MCPG 4-(1-Amino-1-carboxy-ethyl)-benzoic acid CHEMBL299683 | MCPG
TypeSmall organic molecule
Emp. Form.C10H11NO4
Mol. Mass.209.1986
SMILESCC(N)(C(O)=O)c1ccc(cc1)C(O)=O