Reaction Details
Target72 kDa type IV collagenase
LigandBDBM50288702
Substrate/Competitorn/a
Meas. Tech.ChEBML_101928
Ki 86±n/a nM
Citation Chapman, KTDurette, PLCaldwell, CGSperow, KMNiedzwiecki, LMHarrison, RKSaphos, CChristen, AJOlszewski, JMMoore, VLMacCoss, MHagmann, WK Orally active inhibitors of stromelysin-1 (MMP-3) Bioorg Med Chem Lett6:803-806 (1996)    Article
 
72 kDa type IV collagenase
Name:72 kDa type IV collagenase
Type:Enzyme
Mol. Mass.:73870.36
Organism:Homo sapiens (Human)
Description: P08253
Residue:660
BDBM50288702
NameBDBM50288702
Synonyms:(R)-6-(1,3-Dioxo-1,3-dihydro-isoindol-2-yl)-2-[(S)-1-((S)-3-methyl-1-phenylcarbamoyl-butylcarbamoyl)-3-phenyl-propylamino]-hexanoic acid CHEMBL112180
TypeSmall organic molecule
Emp. Form.C36H42N4O6
Mol. Mass.626.7419
SMILESCC(C)C[C@H](NC(=O)[C@H](CCc1ccccc1)N[C@H](CCCCN1C(=O)c2ccccc2C1=O)C(O)=O)C(=O)Nc1ccccc1