Reaction Details
Target72 kDa type IV collagenase
LigandBDBM50289125
Substrate/Competitorn/a
Meas. Tech.ChEBML_101928
Ki 470±n/a nM
Citation Chapman, KTDurette, PLCaldwell, CGSperow, KMNiedzwiecki, LMHarrison, RKSaphos, CChristen, AJOlszewski, JMMoore, VLMacCoss, MHagmann, WK Orally active inhibitors of stromelysin-1 (MMP-3) Bioorg Med Chem Lett6:803-806 (1996)    Article
 
72 kDa type IV collagenase
Name:72 kDa type IV collagenase
Type:Enzyme
Mol. Mass.:73870.36
Organism:Homo sapiens (Human)
Description: P08253
Residue:660
BDBM50289125
NameBDBM50289125
Synonyms:CHEMBL167705 | [(S)-1-(3-Methyl-1-phenylcarbamoyl-butylcarbamoyl)-3-phenyl-propylamino]-acetic acid
TypeSmall organic molecule
Emp. Form.C24H31N3O4
Mol. Mass.425.5206
SMILESCC(C)C[C@H](NC(=O)[C@H](CCc1ccccc1)NCC(O)=O)C(=O)Nc1ccccc1