Reaction Details
TargetProtein kinase C eta type
LigandBDBM50055671
Substrate/Competitorn/a
Meas. Tech.ChEMBL_161123 (CHEMBL770094)
IC50 260±n/a nM
Citation Hu, HHollinshead, SPHall, SEKalter, KBallas, LM Synthesis and protein kinase C inhibitory activities of indane analogs of balanol Bioorg Med Chem Lett6:973-978 (1996)    Article
 
Protein kinase C eta type
Name:Protein kinase C eta type
Type:Enzyme
Mol. Mass.:77844.26
Organism:Homo sapiens (Human)
Description:The recombinant human PKC enzymes were produced using a baculovirus expression system in SF9 cells
Residue:683
BDBM50055671
NameBDBM50055671
Synonyms:4-(2-Carboxy-6-hydroxy-benzoyl)-3,5-dihydroxy-benzoic acid (3S,4S)-3-(4-hydroxy-benzoylamino)-azepan-4-yl ester | CHEMBL77970
TypeSmall organic molecule
Emp. Form.C28H26N2O10
Mol. Mass.550.5134
SMILESOC(=O)c1cccc(O)c1C(=O)c1c(O)cc(cc1O)C(=O)O[C@H]1CCCNC[C@@H]1NC(=O)c1ccc(O)cc1