Reaction Details
TargetProtein kinase C gamma type
LigandBDBM50289207
Substrate/Competitorn/a
Meas. Tech.ChEBML_161146
IC50 160±n/a nM
Citation Hu, HHollinshead, SPHall, SEKalter, KBallas, LM Synthesis and protein kinase C inhibitory activities of indane analogs of balanol Bioorg Med Chem Lett6:973-978 (1996)    Article
 
Protein kinase C gamma type
Name:Protein kinase C gamma type
Type:Enzyme
Mol. Mass.:78458.05
Organism:Homo sapiens (Human)
Description:The recombinant human PKC enzymes were produced using a baculovirus expression system in SF9 cells
Residue:697
BDBM50289207
NameBDBM50289207
Synonyms:4-(2-Carboxy-6-hydroxy-benzoyl)-3,5-dihydroxy-benzoic acid (R)-1-(4-hydroxy-benzoylamino)-indan-2-yl ester | CHEMBL177308
TypeSmall organic molecule
Emp. Form.C31H23NO10
Mol. Mass.569.515
SMILESOC(=O)c1cccc(O)c1C(=O)c1c(O)cc(cc1O)C(=O)OC1Cc2ccccc2[C@H]1NC(=O)c1ccc(O)cc1