Reaction Details
TargetProtein kinase C delta type
LigandBDBM3152
Substrate/Competitorn/a
Meas. Tech.ChEBML_152992
IC50 5±n/a nM
Citation Hu, HHollinshead, SPHall, SEKalter, KBallas, LM Synthesis and protein kinase C inhibitory activities of indane analogs of balanol Bioorg Med Chem Lett6:973-978 (1996)    Article
 
Protein kinase C delta type
Name:Protein kinase C delta type
Type:Enzyme
Mol. Mass.:77516.79
Organism:Homo sapiens (Human)
Description:The recombinant human PKC enzymes were produced using a baculovirus expression system in SF9 cells
Residue:676
BDBM3152
NameBDBM3152
Synonyms:2-{[2,6-dihydroxy-4-({[(3R,4R)-4-[(4-hydroxybenzene)amido]pyrrolidin-3-yl]oxy}carbonyl)phenyl]carbonyl}-3-hydroxybenzoic acid CHEMBL59828
TypeSmall organic molecule
Emp. Form.C26H22N2O10
Mol. Mass.522.4603
SMILESOC(=O)c1cccc(O)c1C(=O)c1c(O)cc(cc1O)C(=O)O[C@@H]1CNC[C@H]1NC(=O)c1ccc(O)cc1