Reaction Details
TargetProtein kinase C beta type
LigandBDBM50289209
Substrate/Competitorn/a
Meas. Tech.ChEMBL_152989 (CHEMBL759474)
IC50 39000±n/a nM
Citation Hu, HHollinshead, SPHall, SEKalter, KBallas, LM Synthesis and protein kinase C inhibitory activities of indane analogs of balanol Bioorg Med Chem Lett6:973-978 (1996)    Article
 
Protein kinase C beta type
Name:Protein kinase C beta type
Type:Enzyme
Mol. Mass.:76873.67
Organism:Homo sapiens (Human)
Description:The recombinant human PKC enzymes were produced using a baculovirus expression system in SF9 cells
Residue:671
BDBM50289209
NameBDBM50289209
Synonyms:4-(2-Carboxy-6-hydroxy-benzoyl)-3,5-dihydroxy-benzoic acid (1R,2R)-1-(4-hydroxy-benzoylamino)-indan-2-yl ester | CHEMBL444877
TypeSmall organic molecule
Emp. Form.C31H23NO10
Mol. Mass.569.515
SMILESOC(=O)c1cccc(O)c1C(=O)c1c(O)cc(cc1O)C(=O)O[C@@H]1Cc2ccccc2[C@H]1NC(=O)c1ccc(O)cc1