Reaction Details
TargetMHC class II antigen
LigandBDBM50289267
Substrate/Competitorn/a
Meas. Tech.ChEBML_192856
IC50 85±n/a nM
Citation Cunningham, BRRivetna, MTolman, RLFlattery, SJNichols, EASchwartz, CDWicker, LSHermes, JDJones, AB SAR for MHC class II binding tetrapeptides: Correlation with potential binding site Bioorg Med Chem Lett7:19-24 (1997)    Article
 
MHC class II antigen
Name:MHC class II antigen
Type:PROTEIN
Mol. Mass.:29917.79
Organism:Homo sapiens (Human)
Description:ChEMBL_192854
Residue:266
BDBM50289267
NameBDBM50289267
Synonyms:((R)-2-Benzo[b]thiophen-3-yl-1-{(S)-1-[(S)-1-((S)-1-carbamoyl-3-methyl-butylcarbamoyl)-ethylcarbamoyl]-2-methyl-propylcarbamoyl}-ethyl)-carbamic acid ethyl ester | CHEMBL79058
TypeSmall organic molecule
Emp. Form.C28H41N5O6S
Mol. Mass.575.72
SMILESCCOC(=O)N[C@H](Cc1csc2ccccc12)C(=O)N[C@@H](C(C)C)C(=O)N[C@@H](C)C(=O)N[C@@H](CC(C)C)C(N)=O