Reaction Details
TargetMHC class II antigen
LigandBDBM50289272
Substrate/Competitorn/a
Meas. Tech.ChEMBL_192856 (CHEMBL799390)
IC50 75±n/a nM
Citation Cunningham, BRRivetna, MTolman, RLFlattery, SJNichols, EASchwartz, CDWicker, LSHermes, JDJones, AB SAR for MHC class II binding tetrapeptides: Correlation with potential binding site Bioorg Med Chem Lett7:19-24 (1997)    Article
 
MHC class II antigen
Name:MHC class II antigen
Type:PROTEIN
Mol. Mass.:29917.79
Organism:Homo sapiens (Human)
Description:ChEMBL_192854
Residue:266
BDBM50289272
NameBDBM50289272
Synonyms:CHEMBL80597 | [(R)-1-{(S)-1-[(S)-1-((S)-1-Carbamoyl-3-methyl-butylcarbamoyl)-ethylcarbamoyl]-2-methyl-propylcarbamoyl}-2-(4-ethoxy-phenyl)-ethyl]-carbamic acid ethyl ester
TypeSmall organic molecule
Emp. Form.C28H45N5O7
Mol. Mass.563.6862
SMILESCCOC(=O)N[C@H](Cc1ccc(OCC)cc1)C(=O)N[C@@H](C(C)C)C(=O)N[C@@H](C)C(=O)N[C@@H](CC(C)C)C(N)=O