Reaction Details
TargetMHC class II antigen
LigandBDBM50289248
Substrate/Competitorn/a
Meas. Tech.ChEMBL_192854 (CHEMBL800187)
IC50 67±n/a nM
Citation Cunningham, BRRivetna, MTolman, RLFlattery, SJNichols, EASchwartz, CDWicker, LSHermes, JDJones, AB SAR for MHC class II binding tetrapeptides: Correlation with potential binding site Bioorg Med Chem Lett7:19-24 (1997)    Article
 
MHC class II antigen
Name:MHC class II antigen
Type:PROTEIN
Mol. Mass.:29917.79
Organism:Homo sapiens (Human)
Description:ChEMBL_192854
Residue:266
BDBM50289248
NameBDBM50289248
Synonyms:((S)-1-{(S)-5-Amino-1-[(S)-1-((S)-1-carbamoyl-3-methyl-butylcarbamoyl)-ethylcarbamoyl]-pentylcarbamoyl}-2-phenyl-ethyl)-carbamic acid ethyl ester | CHEMBL310312
TypeSmall organic molecule
Emp. Form.C27H44N6O6
Mol. Mass.548.6749
SMILESCCOC(=O)N[C@@H](Cc1ccccc1)C(=O)N[C@@H](CCCCN)C(=O)N[C@@H](C)C(=O)N[C@@H](CC(C)C)C(N)=O