Reaction Details
TargetMHC class II antigen
LigandBDBM50289264
Substrate/Competitorn/a
Meas. Tech.ChEMBL_192854 (CHEMBL800187)
IC50 25±n/a nM
Citation Cunningham, BRRivetna, MTolman, RLFlattery, SJNichols, EASchwartz, CDWicker, LSHermes, JDJones, AB SAR for MHC class II binding tetrapeptides: Correlation with potential binding site Bioorg Med Chem Lett7:19-24 (1997)    Article
 
MHC class II antigen
Name:MHC class II antigen
Type:PROTEIN
Mol. Mass.:29917.79
Organism:Homo sapiens (Human)
Description:ChEMBL_192854
Residue:266
BDBM50289264
NameBDBM50289264
Synonyms:(S)-4-Methyl-2-((S)-2-{(S)-3-methyl-2-[(S)-2-(4-oxo-pentanoylamino)-3-phenyl-propionylamino]-butyrylamino}-propionylamino)-pentanoic acid amide | CHEMBL80852
TypeSmall organic molecule
Emp. Form.C28H43N5O6
Mol. Mass.545.6709
SMILESCC(C)C[C@H](NC(=O)[C@H](C)NC(=O)[C@@H](NC(=O)[C@H](Cc1ccccc1)NC(=O)CCC(C)=O)C(C)C)C(N)=O