Reaction Details
TargetMHC class II antigen
LigandBDBM50289265
Substrate/Competitorn/a
Meas. Tech.ChEMBL_192854 (CHEMBL800187)
IC50 31±n/a nM
Citation Cunningham, BRRivetna, MTolman, RLFlattery, SJNichols, EASchwartz, CDWicker, LSHermes, JDJones, AB SAR for MHC class II binding tetrapeptides: Correlation with potential binding site Bioorg Med Chem Lett7:19-24 (1997)    Article
 
MHC class II antigen
Name:MHC class II antigen
Type:PROTEIN
Mol. Mass.:29917.79
Organism:Homo sapiens (Human)
Description:ChEMBL_192854
Residue:266
BDBM50289265
NameBDBM50289265
Synonyms:(S)-2-[(S)-3-Carbamoyl-2-((S)-2-{[(R)-2-ethoxycarbonylamino-3-(1H-indol-3-yl)-propionyl]-methyl-amino}-5-guanidino-pentanoylamino)-propionylamino]-3-methyl-butyric acid | CHEMBL312367
TypeSmall organic molecule
Emp. Form.C30H45N9O8
Mol. Mass.659.7338
SMILESCCOC(=O)N[C@H](Cc1c[nH]c2ccccc12)C(=O)N(C)[C@@H](CCCNC(N)=N)C(=O)N[C@@H](CC(N)=O)C(=O)N[C@@H](C(C)C)C(O)=O