Reaction Details
TargetMHC class II antigen
LigandBDBM50289283
Substrate/Competitorn/a
Meas. Tech.ChEMBL_192854 (CHEMBL800187)
IC50 240±n/a nM
Citation Cunningham, BRRivetna, MTolman, RLFlattery, SJNichols, EASchwartz, CDWicker, LSHermes, JDJones, AB SAR for MHC class II binding tetrapeptides: Correlation with potential binding site Bioorg Med Chem Lett7:19-24 (1997)    Article
 
MHC class II antigen
Name:MHC class II antigen
Type:PROTEIN
Mol. Mass.:29917.79
Organism:Homo sapiens (Human)
Description:ChEMBL_192854
Residue:266
BDBM50289283
NameBDBM50289283
Synonyms:Acetic acid 4-((R)-2-{(S)-1-[(S)-1-((S)-1-carbamoyl-3-methyl-butylcarbamoyl)-ethylcarbamoyl]-2-methyl-propylcarbamoyl}-2-ethoxycarbonylamino-ethyl)-phenyl ester | CHEMBL80527
TypeSmall organic molecule
Emp. Form.C28H43N5O8
Mol. Mass.577.6697
SMILESCCOC(=O)N[C@H](Cc1ccc(OC(C)=O)cc1)C(=O)N[C@@H](C(C)C)C(=O)N[C@@H](C)C(=O)N[C@@H](CC(C)C)C(N)=O