Reaction Details
Target5-hydroxytryptamine receptor 2A/2B/2C
LigandBDBM35254
Substrate/Competitorn/a
Meas. Tech.ChEMBL_2117 (CHEMBL617201)
Ki 10±n/a nM
Citation Calligaro, DOFairhurst, JHotten, TMMoore, NATupper, DE The synthesis and biological activity of some known and putative metabolites of the atypical antipsychotic agent olanzapine (LY170053) Bioorg Med Chem Lett7:25-30 (1997)    Article
 
5-hydroxytryptamine receptor 2A/2B/2C
Name:5-hydroxytryptamine receptor 2A/2B/2C
Synonyms:Serotonin 2 (5-HT2) receptor
Type:n/a
Mol. Mass.:n/a
Description:ASSAY_ID of ChEMBL is 306637
Components:This complex has 3 components.
Component 1
Name:5-hydroxytryptamine receptor 2B
Type:G Protein-Coupled Receptor (GPCR)
Mol. Mass.:54312.47
Organism:Homo sapiens (Human)
Description:Receptor binding assays were performed using human clone stably expressed in CHO cells.
Residue:481
Component 2
Name:5-hydroxytryptamine receptor 2C
Synonyms:5-HT-2C 5-HT2C-INI 5-HTR2C 5-hydroxytryptamine receptor 2C (5-HT-2C) 5HT-1C HTR1C Serotonin (5-HT3) receptor Serotonin Receptor 2C
Type:G Protein-Coupled Receptor (GPCR)
Mol. Mass.:51836.79
Organism:Homo sapiens (Human)
Description:P28335
Residue:458
Component 3
Name:5-hydroxytryptamine receptor 2A
Synonyms:5-HT-2 5-HT2A 5-hydroxytryptamine receptor 2A (5HT-2A) 5HT2A_HUMAN HTR2A | Serotonin receptor 2A
Type:undefined
Mol. Mass.:52607.65
Organism:Homo sapiens (Human)
Description:P28223
Residue:471
BDBM35254
NameBDBM35254
Synonyms:2-methyl-4-(4-methylpiperazin-1-yl)-10H-thieno[2,3-b][1,5]benzodiazepine Olansek Zyprexa | olanzapine
TypeSmall organic molecule
Emp. Form.C17H20N4S
Mol. Mass.312.432
SMILESCN1CCN(CC1)C1=Nc2ccccc2Nc2sc(C)cc12