Reaction Details
TargetProstaglandin G/H synthase 2
LigandBDBM50029600
Substrate/Competitorn/a
Meas. Tech.ChEBML_51703
IC50 2±n/a nM
Citation Thérien, MBrideau, CChan, CCCromlish, WAGauthier, JYGordon, RGreig, GKargman, SLau, CKLeblanc, YLi, CSO'Neill, GPRiendeau, DRoy, PWang, ZXu, LPrasit, P Synthesis and biological evaluation of 5,6-diarylimidazo[2.1-b]thiazole as selective COX-2 inhibitors Bioorg Med Chem Lett7:47-52 (1997)    Article
 
Prostaglandin G/H synthase 2
Name:Prostaglandin G/H synthase 2
Type:Enzyme
Mol. Mass.:69003.89
Organism:Homo sapiens (Human)
Description:Recombinant Cox-2 provided by Cayman (Cayman Chemical Co.,Ann Arbor, MI).
Residue:604
BDBM50029600
NameBDBM50029600
Synonyms:5-Bromo-2-(4-fluoro-phenyl)-3-(4-methanesulfonyl-phenyl)-thiophene CHEMBL42485 | DUP-697
TypeSmall organic molecule
Emp. Form.C17H12BrFO2S2
Mol. Mass.411.308
SMILESCS(=O)(=O)c1ccc(cc1)-c1cc(Br)sc1-c1ccc(F)cc1