Reaction Details
TargetProstaglandin G/H synthase 2
LigandBDBM50029600
Substrate/Competitorn/a
Meas. Tech.ChEMBL_159894 (CHEMBL766722)
IC50 60±n/a nM
Citation Roy, PLeblanc, YBall, RGBrideau, CChan, CCChauret, NCromlish, WEthier, DGauthier, JYGordon, RGreig, GGuay, JKargman, SLau, CKO'Neill, GSilva, JThérien, MStaden, CvWong, EXu, L A new series of selective COX-2 inhibitors: 5,6-diarylthiazolo[3,2-b][1,2,4]triazoles Bioorg Med Chem Lett7:57-62 (1997)    Article
 
Prostaglandin G/H synthase 2
Name:Prostaglandin G/H synthase 2
Type:Enzyme
Mol. Mass.:69003.89
Organism:Homo sapiens (Human)
Description:Recombinant Cox-2 provided by Cayman (Cayman Chemical Co.,Ann Arbor, MI).
Residue:604
BDBM50029600
NameBDBM50029600
Synonyms:5-Bromo-2-(4-fluoro-phenyl)-3-(4-methanesulfonyl-phenyl)-thiophene CHEMBL42485 | DUP-697
TypeSmall organic molecule
Emp. Form.C17H12BrFO2S2
Mol. Mass.411.308
SMILESCS(=O)(=O)c1ccc(cc1)-c1cc(Br)sc1-c1ccc(F)cc1