Reaction Details
TargetProstaglandin G/H synthase 2
LigandBDBM50289323
Substrate/Competitorn/a
Meas. Tech.ChEMBL_159931 (CHEMBL769656)
IC50 10±n/a nM
Citation Roy, PLeblanc, YBall, RGBrideau, CChan, CCChauret, NCromlish, WEthier, DGauthier, JYGordon, RGreig, GGuay, JKargman, SLau, CKO'Neill, GSilva, JThérien, MStaden, CvWong, EXu, L A new series of selective COX-2 inhibitors: 5,6-diarylthiazolo[3,2-b][1,2,4]triazoles Bioorg Med Chem Lett7:57-62 (1997)    Article
 
Prostaglandin G/H synthase 2
Name:Prostaglandin G/H synthase 2
Type:Enzyme
Mol. Mass.:69003.89
Organism:Homo sapiens (Human)
Description:Recombinant Cox-2 provided by Cayman (Cayman Chemical Co.,Ann Arbor, MI).
Residue:604
BDBM50289323
NameBDBM50289323
Synonyms:5-(4-Methanesulfonyl-phenyl)-6-phenyl-thiazolo[3,2-b][1,2,4]triazole | CHEMBL158316
TypeSmall organic molecule
Emp. Form.C17H13N3O2S2
Mol. Mass.355.434
SMILESCS(=O)(=O)c1ccc(cc1)-c1sc2ncnn2c1-c1ccccc1