Reaction Details
TargetProstaglandin G/H synthase 2
LigandBDBM50289327
Substrate/Competitorn/a
Meas. Tech.ChEBML_159894
IC50 3±n/a nM
Citation Roy, PLeblanc, YBall, RGBrideau, CChan, CCChauret, NCromlish, WEthier, DGauthier, JYGordon, RGreig, GGuay, JKargman, SLau, CKO'Neill, GSilva, JThérien, MStaden, CvWong, EXu, L A new series of selective COX-2 inhibitors: 5,6-diarylthiazolo[3,2-b][1,2,4]triazoles Bioorg Med Chem Lett7:57-62 (1997)    Article
 
Prostaglandin G/H synthase 2
Name:Prostaglandin G/H synthase 2
Type:Enzyme
Mol. Mass.:69003.89
Organism:Homo sapiens (Human)
Description:Recombinant Cox-2 provided by Cayman (Cayman Chemical Co.,Ann Arbor, MI).
Residue:604
BDBM50289327
NameBDBM50289327
Synonyms:5-(4-Methanesulfonyl-phenyl)-6-m-tolyl-2-trifluoromethyl-thiazolo[3,2-b][1,2,4]triazole | CHEMBL421826
TypeSmall organic molecule
Emp. Form.C19H14F3N3O2S2
Mol. Mass.437.459
SMILESCc1cccc(c1)-c1c(sc2nc(nn12)C(F)(F)F)-c1ccc(cc1)S(C)(=O)=O