Reaction Details
TargetCaspase-1
LigandBDBM50289405
Substrate/Competitorn/a
Meas. Tech.ChEBML_90985
Ki 1.1±n/a nM
Citation Semple, GAshworth, DMBaker, GRBatt, ARBaxter, AJBenzies, DWElliot, LHEvans, DFranklin, RJHudson, PJenkins, PDPitt, GRRooker, DPSheppard, ASzelke, MYamamoto, SIsomura, Y PYRIDONE-BASED PEPTIDOMIMETIC INHIBITORS OF INTERLEUKIN-1β-CONVERTING ENZYME (ICE) Bioorg Med Chem Lett7:1337-1342 (1997)    Article
 
Caspase-1
Name:Caspase-1
Type:Enzyme
Mol. Mass.:45154.13
Organism:Homo sapiens (Human)
Description:P29466
Residue:404
BDBM50289405
NameBDBM50289405
Synonyms:CHEMBL2371932 | Peptidic phenyl ketoether analogue
TypeSmall organic molecule
Emp. Form.C30H38N4O9
Mol. Mass.598.6441
SMILESCC(C)[C@H](NC(=O)[C@H](Cc1ccc(O)cc1)NC(C)=O)C(=O)N[C@@H](C)C(=O)N[C@@H](CC(O)=O)C(=O)COc1ccccc1