Reaction Details
TargetSigma non-opioid intracellular receptor 1
LigandBDBM50289552
Substrate/Competitorn/a
Meas. Tech.ChEBML_201293
IC50 1±n/a nM
Citation Mantegani, SBrambilla, ECremonesi, PCaccia, CFornaretto, MGCarfagna, NColombo, MMcArthur, RAVarasi, M (E) and (Z)-3-Styrylpiperidines as sigma ligands Bioorg Med Chem Lett7:1525-1530 (1997)    Article
 
Sigma non-opioid intracellular receptor 1
Name:Sigma non-opioid intracellular receptor 1
Type:Enzyme Catalytic Domain
Mol. Mass.:25266.54
Organism:RAT
Description:Q9R0C9
Residue:223
BDBM50289552
NameBDBM50289552
Synonyms:1-(3-Methyl-but-2-enyl)-3-((Z)-styryl)-piperidine | CHEMBL40031
TypeSmall organic molecule
Emp. Form.C18H25N
Mol. Mass.255.3978
SMILES[#6]\[#6](-[#6])=[#6]/[#6]-[#7]-1-[#6]-[#6]-[#6]-[#6](-[#6]-1)\[#6]=[#6]/c1ccccc1