Reaction Details
TargetBeta-2 adrenergic receptor
LigandBDBM50002132
Substrate/Competitorn/a
Meas. Tech.ChEBML_38464
Ki 3.2±n/a nM
Citation Sher, PMMathur, AFisher, LGWu, GSkwish, SMichel, IMSeiler, SMDickinson, KE Carboxyl-promoted enhancement of selectivity for the β3 adrenergic receptor. Negative charge of the sulfonic acid BMS-187413 introduces-β3 binding selectivity Bioorg Med Chem Lett7:1583-1588 (1997)    Article
 
Beta-2 adrenergic receptor
Name:Beta-2 adrenergic receptor
Type:n/a
Mol. Mass.:46461.69
Organism:Homo sapiens (Human)
Description:P07550
Residue:413
BDBM50002132
NameBDBM50002132
Synonyms:(4-{(R)-2-[(R)-2-(3-Chloro-phenyl)-2-hydroxy-ethylamino]-propyl}-phenoxy)-acetic acid methyl ester CHEMBL38486
TypeSmall organic molecule
Emp. Form.C20H24ClNO4
Mol. Mass.377.862
SMILESCOC(=O)COc1ccc(C[C@@H](C)NC[C@H](O)c2cccc(Cl)c2)cc1