Reaction Details
TargetBeta-1 adrenergic receptor
LigandBDBM50073045
Substrate/Competitorn/a
Meas. Tech.ChEBML_37403
Ki 7600±n/a nM
Citation Sher, PMMathur, AFisher, LGWu, GSkwish, SMichel, IMSeiler, SMDickinson, KE Carboxyl-promoted enhancement of selectivity for the β3 adrenergic receptor. Negative charge of the sulfonic acid BMS-187413 introduces-β3 binding selectivity Bioorg Med Chem Lett7:1583-1588 (1997)    Article
 
Beta-1 adrenergic receptor
Name:Beta-1 adrenergic receptor
Type:G Protein-Coupled Receptor (GPCR)
Mol. Mass.:51338.40
Organism:Homo sapiens (Human)
Description:P08588
Residue:477
BDBM50073045
NameBDBM50073045
Synonyms:(4-{(R)-2-[(R)-2-(3-Chloro-phenyl)-2-hydroxy-ethylamino]-propyl}-phenoxy)-methanesulfonic acid | CHEMBL38538
TypeSmall organic molecule
Emp. Form.C18H22ClNO5S
Mol. Mass.399.889
SMILESC[C@H](Cc1ccc(OCS(O)(=O)=O)cc1)NC[C@H](O)c1cccc(Cl)c1