Reaction Details
TargetBeta-3 adrenergic receptor
LigandBDBM50289567
Substrate/Competitorn/a
Meas. Tech.ChEMBL_39054 (CHEMBL652055)
Ki 3700±n/a nM
Citation Sher, PMMathur, AFisher, LGWu, GSkwish, SMichel, IMSeiler, SMDickinson, KE Carboxyl-promoted enhancement of selectivity for the β3 adrenergic receptor. Negative charge of the sulfonic acid BMS-187413 introduces-β3 binding selectivity Bioorg Med Chem Lett7:1583-1588 (1997)    Article
 
Beta-3 adrenergic receptor
Name:Beta-3 adrenergic receptor
Type:G Protein-Coupled Receptor (GPCR)
Mol. Mass.:43534.88
Organism:Homo sapiens (Human)
Description:n/a
Residue:408
BDBM50289567
NameBDBM50289567
Synonyms:2-(4-{(R)-2-[(R)-2-(3-Chloro-phenyl)-2-hydroxy-ethylamino]-propyl}-phenoxy)-acetamide | CHEMBL38569
TypeSmall organic molecule
Emp. Form.C19H23ClN2O3
Mol. Mass.362.851
SMILESC[C@H](Cc1ccc(OCC(N)=O)cc1)NC[C@H](O)c1cccc(Cl)c1