Reaction Details
TargetSerine protease 1
LigandBDBM50289583
Substrate/Competitorn/a
Meas. Tech.ChEBML_210656
Ki 25±n/a nM
Citation Quan, MLWityak, JDominguez, CDuncia, JVKettner, CAEllis, CDLiauw, AYPark, JMSantella, JBKnabb, RMThoolen, MJWeber, PCWexler, RR Biaryl substituted alkylboronate esters as thrombin inhibitors Bioorg Med Chem Lett7:1595-1600 (1997)    Article
 
Serine protease 1
Name:Serine protease 1
Type:Enzyme
Mol. Mass.:26557.80
Organism:Homo sapiens (Human)
Description:P07477
Residue:247
BDBM50289583
NameBDBM50289583
Synonyms:(3-{5-[(R)-4-Guanidino-1-((2S,6R)-2,9,9-trimethyl-3,5-dioxa-4-bora-tricyclo[6.1.1.0*2,6*]dec-4-yl)-butylcarbamoyl]-furan-2-yl}-phenyl)-carbamic acid tert-butyl ester | CHEMBL297536
TypeSmall organic molecule
Emp. Form.C31H44BN5O6
Mol. Mass.593.522
SMILESCC(C)(C)OC(=O)Nc1cccc(c1)-c1ccc(o1)C(=O)N[C@@H](CCCNC(N)=N)B1O[C@@H]2CC3CC(C3(C)C)[C@]2(C)O1